Unknown error_ devtoolsactiveport file doesn t exist wsl

Unknown error_ devtoolsactiveport file doesn t exist wsl

Laurentide windshield washer fluid sds

  • What would you do with a million pounds funny,

    Doom emacs tramp

  • Ford 302 conversion kit,Mar 12, 2020 · org.openqa.selenium.WebDriverException: unknown error: Chrome failed to start: exited abnormally. (unknown error: DevToolsActivePort file doesn’t exist) And how to define spesific room for jitsi torture? ,unknown error: DevToolsActivePort file doesn't exist while trying to , Thumb rule. A common cause for Chrome to crash during startup is running Chrome as root user ( administrator ) on Linux. While it is possible As per my observation DevToolsActivePort file doesn't exist is caused when chrome is unable to find its reference in scoped_dirXXXXX ...

    T18 transmission shift pattern

    This is the reason of almost all the cases where cron doesn't seem to run. Cron always runs with a mostly empty environment. HOME, LOGNAME, and SHELL are set; and a very limited PATH. It is therefore advisable to use complete paths to executables, and export any variables you need in your script when using cron.

  • App hacker.funFile "/usr/local/anaconda3/lib/python3.6/site-packages/selenium/webdriver/remote/errorhandler.py", line 242, in check_response raise exception_class(message, screen, stacktrace) selenium.common.exceptions.WebDriverException: Message: unknown error: DevToolsActivePort...,selenium.common.exceptions.WebDriverException: Message: unknown error: DevToolsActivePort file doesn't exist.

    Mastiff rescue east coast

    self.error_handler.check_response(response) File "C:\python3.7\lib\site-packages\selenium\webdriver\remote\errorhandler.py", line 242, in check_response raise exception_class(message, screen, stacktrace) selenium.common.exceptions.WebDriverException: Message: unknown error: cannot find Chrome binary

  • Awae course download...to start: exited abnormally. (unknown error: DevToolsActivePort file doesn't exist). entry-point env-file environment environment-variables envoy envoyproxy eof epmd ergonomics worker workflow wp-cli wpf wpml write ws-federation wsdl wsgi wsl-2 wso2 wso2-am wso2carbon wso2is wso2sp wss...,(unknown error: DevToolsActivePort file doesn't exist) I used the --no-sandbox argument, I have all the external JARs added, and I have set the correct path to the Chrome driver but I just can't seem to get it working.

    Worx wg512 vs wg509

    FAQs: Q: Why don't i have a gameconfig? A: Make sure you verify your game cache just incase some of the files are missing. Also double check you are on the...

  • Furutech cf 201centosでのchromeバージョンダウングレード方法を教えてください。 chromeとchromedriverで78に合わせたのですが、うまくいきません。

    Used flir thermal scope for sale

    Error displaying the error page: Application Instantiation Error: Table I receive error code 1051 Unknown table '<dbname>.<prefix>_session'. I was able to fix the session table. I deleted the .frm file and ran the script.

  • Dstv satellite frequency and symbol ratePostgreSQL forum. PostgreSQL is a powerful, open source relational database system. It has a proven architecture that has earned it a strong reputation for reliability, data integrity, and...

    Relative max and min worksheet

    Selenium::WebDriver::Error::UnknownError: unknown error: Chrome failed to start: crashed (unknown error: DevToolsActivePort file doesn't exist) (The process started from chrome location /usr/bin/google-chrome is no longer running, so ChromeDriver is assuming that Chrome has crashed.) ``` と表示されてしまいます。

  • Maxxforce 7 fan clutchOct 09, 2019 · [ Natty] php PHP: if file doesn't exist then exit script By: Angga Febrian Sahid 3.0; [ Natty ] lucene Why doesn't routing work with ElasticSearch Bulk API? By: NiYanchun 1.5 ;

    Download file from byte array angular 6

    This command doesn’t work at all, it says make: *** No rule to make target 'test_person_detection_test'. Stop. and the right target actually is test_person_detection_test_int8 as it used to be when it was an experimental version.

  • Secrets of the zoo vets

    How hard is it to get into georgetown smp

    Selenium::WebDriver::Error::UnknownError: unknown error: DevToolsActivePort file doesn't exist (Driver info: chromedriver=2.39.562737 The above docker file contains the latest chrome and chromedriver versions, respectively 67 and 2.39. I've tried older versions aswell with the same above...

  • Wholesale pumpkins california> Fusion 360 Support. > A360 Error Message: File doesn't exist... Help. I can access the files from my old computer still and from any computer that has fusion 360 but not my new MacBook Pro.

    Pioneer vsx 1021 ue33

    Selenium::WebDriver::Error::UnknownError: unknown error: Chrome failed to start: crashed (unknown error: DevToolsActivePort file doesn't exist) (The process started from chrome location /usr/bin/google-chrome is no longer running, so ChromeDriver is assuming that Chrome has crashed.) #0 0x7f87e934a7a9 <unknown>

  • Maxguard gelcoatSelenium::WebDriver::Error::UnknownError: unknown error: Chrome failed to start: exited abnormally (unknown error: DevToolsActivePort file doesn't exist) (The process started from chrome location /usr/bin/google-chrome is no longer running, so ChromeDriver is assuming that Chrome has crashed.) ,...parameters) File "/usr/local/lib/python3.6/dist-packages/selenium/webdriver/remote/webdriver.py", line 321, in execute self.error_handler.check_response(response) File. Message: unknown error: Chrome failed to start: crashed (unknown error: DevToolsActivePort file doesn't exist) (The...,Open Closed Paid Out. Unknown error: DevToolsActivePort file doesn't exist. Current Behavior: I am having this error when I typed: npm test Error: Failed to create session. unknown error: Chrome failed to start: was killed. (unknown error: DevToolsActivePort file doesn't exist).

    Messenger video call on tv

    Facebook\WebDriver\Exception\UnknownErrorException: unknown error: Chrome failed to start: exited abnormally. (unknown error: DevToolsActivePort file doesn't exist) (The process started from chrome location /usr/bin/chromium-browser is no longer running, so ChromeDriver is assuming that Chrome has crashed.)

  • Vr cover quest 2 amazon(CFErrorDomainLaunchd error 2.)" the helper file (com.ea.origin.ESHelper) is written in the PrivildgedHelper folder but then the install helper popup keeps appearing regardless ... The overrides files seem not be able to be modified. what permissions should that file have ??

    Led light for mushroom growing

    Jan 30, 2018 · Installation of the Windows version wasn’t reassuring, even after bypassing a “Publisher: Unknown” error: Trying out the Ubuntu build was the natural next step. The version in the default Ubuntu repo, 4.0.0, wasn’t recommended for the course, but 4.2.1 is available in the Octave PPA .

  • Pastebin tv listIn Visual Studio for Mac, support for symbol servers doesn’t exist yet, so Source Link only works with NuGet packages that contain their own debug symbols. If you’re interested in symbol server support, please add your vote to the symbol server suggestion on the Visual Studio Developer Community site. Notes. A few notes: ,Selenium::WebDriver::Error::UnknownError: unknown error: Chrome failed to start: exited abnormally (unknown error: DevToolsActivePort file doesn't exist) (The process started from chrome location /usr/bin/google-chrome is no longer running, so ChromeDriver is assuming that Chrome has crashed.) 以下の記事を参考にしました。

    Botw amiibo codes

    Exception in thread "main" org.openqa.selenium.WebDriverException: unknown error: DevToolsActivePort file doesn't exist (Driver info: chromedriver=2.40.565498 Error: The file…doesn't exist when calling writeToFile on imageData.

  • Trane 1050 error codesJul 19, 2020 · 1WebDriverException: unknown error: DevToolsActivePort file doesn’t exist I was trying to create a webdriver.Chrome() instance by using the following code 12from selenium import webdriverdriver = webdriver.Chrome() ,Installing and upgrading help. ERROR 1146 table doesn't exist. Was executing mysqldump commands on a DB whose DB server a little messed up and what I was getting for a sql file was really an sql file showing the errors ... not the tables expected for a dump of the entire DB for a moodle that...

    Dgapa air purifier

    Laravel Questions. Find answers to most common laravel questions. Angular; Docker; IOS; Symfony

  • Lab equipment quiz google formJul 24, 2017 · [ Natty] java Android Studio doesn't generate signed apk after update to 2.3 By: Amitraj 1.0; [ Natty ] c# Values are being assigned as null to the Database instead of 0 By: priyanka 1.5 ; ,解决centos7下 selenium报错--unknown error: DevToolsActivePort file doesn't exist. 早上在linux下用selenium启动Chrome时出现问题: 报错:

    Seafloor spreading theory

    Support » Plugin: WordPress File Upload » Upload failed! Target folder doesn't exist. Target folder doesn't exist. Resolved Christopher Harden. (@christopherharden). I tried to do an upload. I received an error that target folder does not exist.

  • This call is being recorded scriptSelenium::WebDriver::Error::UnknownError: unknown error: DevToolsActivePort file doesn't exist (Driver info: chromedriver=2.39.562737 The above docker file contains the latest chrome and chromedriver versions, respectively 67 and 2.39. I've tried older versions aswell with the same above...,AFAIK tunneling is enabled by default because disabling doesn't add any layer of security, primarily just an inconvenience of adding a 3rd party tunnel. I am having a similar problem trying to proxy to internal servers from an off site location and tunneling is enabled + iptables flushed with default action to ACCEPT.

    Alps m10 phone

    It does exist, and I've tried restarting, redoing the destination folder, and using a different destination folder, and it won't recognize any of I'm trying to convert 400 photos to web size in Batch processing (PSCC), but get the error "Could not complete the action because the destination folder doesn't exist."

  • Brake lever and shifter positionしかし最近,「(unknown error: DevToolsActivePort file doesn't exist)」を含むエラーメッセージが出て,アクセスができなくなっていました. ,(unknown error: DevToolsActivePort file doesn't exist) 18 (The process started from chrome location /usr/bin/chromium-browser is no longer running, so ChromeDriver is assuming that Chrome has crashed.)

    Find the projection of u onto v

    Apr 01, 2020 · Hi, I have the same issue: selenium.common.exceptions.WebDriverException: Message: unknown error: Chrome failed to start: exited abnormally (unknown error: DevToolsActivePort file doesn't exist) (The process started from chrome location /usr/bin/chromium-browser is no longer running, so ChromeDriver is assuming that Chrome has crashed.) (Driver ...

  • Bible verses about living life with purpose kjvSetting the chrome binary worked. Gave you best answer. Also completely deleting Chrome/Chromedriver/Pycharm and then reinstalling everything did the trick as well, so now I won't have the set chrome binary.

    Mota hone ka tarika bataye

    Спасибо за ваш ответ на Stack Overflow на русском! Пожалуйста, убедитесь, что публикуемое сообщение отвечает на поставленный вопрос.

  • Mdpi android width解决centos7下 selenium报错--unknown error&colon; DevToolsActivePort file doesn&&num;39&semi;t exist. 解决centos7下 selenium报错--unknown error: DevToolsActivePort file doesn't exist 早上在linux下用selenium启动Chro ... ,Apr 24, 2020 · WebDriverException: Message: unknown error: Chrome failed to start: exited abnormally (unknown error: DevToolsActivePort file doesn ' t exist) (The process started from chrome location / usr / bin / chromium-browser is no longer running, so ChromeDriver is assuming that Chrome has crashed.)

    Nvme drive write protected

    with TFCE correction the p value is not alone a function of t (as in univariate parametric statistics), but now also depends on the size of the cluster a given voxel is part of (within a large cluster moderate t-values can yield very low p-values; the same t-value in a smaller cluster would yield a higher p-value).

  • Lake tahoe drowning july 30 2020Nov 18, 2016 · You won't need the extra ~/.bash_rc lines to get it to work out of the box, but you will likely have to do some standard configuring afterwards depending on your Ansible setup. I've noticed if you don't have admin access on your system, you'll have to run this process on cygwin terminal open as "Run as administrator". ,私は2018年6月6日月曜日にこの問題を見始めました。私たちのテストは毎週実行されます。変更された唯一のことはgoogle-chromeバージョン(現在に更新された)JVMとSeleniumがLinuxボックス(Java 1.8.0_151、Selenium 3.12.0、google-chrome 67.0.3396.62、 xvfb-run).

    Nrf52840 usb

    • Newly installed Az Powershell module on a machine that has not created a cluster before. • Connect to Azure as a Service Principle (SP1). • Create a new AKS cluster. o Specify SP2 in the CLI options. o aksServicePrincipal.json doesn’t exist on disk and does not get created. without the aksServicePrincipal.json file I get

  • Government chapter 5 quizletMar 12, 2020 · org.openqa.selenium.WebDriverException: unknown error: Chrome failed to start: exited abnormally. (unknown error: DevToolsActivePort file doesn’t exist) And how to define spesific room for jitsi torture?

    Kira theme piano

前面讲了工程启动报错“selenium启动报错Unable to read VR Path Registry from C:\Users\clinva\AppData\Local\openvr\openvrpaths.vr”,升级了firefox浏览器到62后问题解决了,但是接下来启动程序有另外一个错误“org.openqa.selenium.remote.ErrorCodes toStatus,HTTP Status: '404' -> incorrect JSON status map...